casenum,zhaz,zBMI,zwaz,zwhz,whplus1,whplus2,whplus3,whmin2,whmin3,bmimin2,bmimin3,bmiplus1,bmiplus2,bmiplus3,hamin2,hamin3,wamin2,wamin3,ID,D02,D03,D04,D05D,D05M,D05A,D06,D07,D14,D15,D16,D17,D18,D19,D20,D21,D22,D23,D24,D25,D26,D27,D28,D29,D30,D31,D32,D33,D34,D35,D36,D37,D38,D39,D40,D41,D42,D43,D44,D45,D46,D47,D48,D49,D50,D51,D54,D55,D56,D57,D58,D59_1,D59_2,D59_3,D59_4,D59_5,D61,D62A,D62b,D63,D64_1,D64_2,D64_3,D64_4,D64_5,VN,HH,REG,PVO,strata,cluster,CHWT,member_id,D67,D69,D70,D71D,D71M,D71A,D72,D73,D74,D75,D76,D77,A13D,A13M,A13Y,AT_AND,AT_ANM,AT_ANY,anthro_date,birth_date,int_date,agedays,agemos,region,urbanr,wgting,sex,lorh,length,weight2,oedema,agedays3,foods,diarrhea,ORT,liquids,breastfeeding,exclusive_breast,breast_status,age_0_23,DD1,DD2,DD3,DD4,DD5,DD6,DD7,DDseven,DDsix,meal_frequency,total_milk_feeds,total_feeds,MAD,DDseven_rec,DDsix_rec,Meal_frequency_rec1,Meal_frequency_rec2,nonbreast_feeds
1,-3.6,-1.04,-3.21,-1.47,2,2,2,2,2,2,2,2,2,2,1,1,1,1,1,2,11,2,15,10,2010,2,29,1,2, , , , , , , , , , , , , , , , , , , , , , , , , , , , , , , , , , , , ,2, , , , , , , , , , , , , , , , , , ,101,1,2,1,14,101,6.875,10011,11,2,29,15,10,2010,5,8.55,77.4,2,1,2,18,3,2013,18,3,2013,3/18/2013,10/15/2010,3/18/2013,885,29,1,1,6.875,2,2,77.4,8.55,n,885, ,0,997, , , , , , , , , , , , , , , , , , , , , , , 
2,-2.45,-2.95,-3.51,-2.77,2,2,2,1,2,1,2,2,2,2,1,2,1,1,1,4,12,1,8,9,2012,0,6,1,1,1,1, ,2,2,2,2, ,2, ,2,2,2, ,2,2,2,2,2,2,2,2,2,2,2,2,2,2,2,2,2,2,2,2,2, ,1,2,5,6,1,2, , , , , ,1,2,2, , , , , ,101,1,2,1,14,101,6.875,10012,12,1,6,8,9,2012,3,5.4,62.8,1,1,2,18,3,2013,18,3,2013,3/18/2013,9/8/2012,3/18/2013,191,6,1,1,6.875,1,1,62.8,5.4,n,191,0,1,1,0,1,1,2,4,0,0,0,0,0,0,0,0,0,0,0,0,0,0,0,0,0,0
3, , , , , , , , , , , , , , , , , , ,1,13,16,1,15,9,2011,1,18,1,1,1,2,2,2,2,1,2, ,2, ,2,2,2, ,1,8,8,2,2,2,2,2,2,2,2,2,2,2,2,2,2,2,2,2,2, ,1,1,4,3,1,2, , , , , ,1,2,2, , , , , ,101,1,2,1,14,101,6.875,10016,16,1,18,15,9,2011,3,9.2,77,0,1,2,18,3,2013,18,3,2013,3/18/2013,9/15/2011,3/18/2013,550,18,1,1,6.875,1,0,77,9.2,n,550,0,1,1,1,0,0,1,7,1,0,0,0,0,0,0,1,1,0,0,0,0,0,0,0,0,0
4,-4,-.57,-3.21,-.95,2,2,2,2,2,2,2,2,2,2,1,1,1,1,2,2,4,2,15,8,2009,3,43,1,2, , , , , , , , , , , , , , , , , , , , , , , , , , , , , , , , , , , , ,2, , , , , , , , , , , , , , , , , , ,101,2,2,1,14,101,6.875,20004,4,2,43,15,8,2009,3,10.1,83.3,2,1,2,18,3,2013,18,3,2013,3/18/2013,8/15/2009,3/18/2013,1311,43,1,1,6.875,2,2,83.3,10.1,n,1311, ,0,997, , , , , , , , , , , , , , , , , , , , , , , 
5,-2.43,-.82,-2.05,-.58,2,2,2,2,2,2,2,2,2,2,1,2,1,2,2,2,5,2,14,8,2012,0,7,1,1,1,1, ,2,2,1,2, ,2, ,2,2,2, ,1,2,2,2,2,2,2,2,2,2,2,2,2,2,2,2,2,2,2,2,2, ,1,2,4,6,1,2, , , , , ,1,2,2, , , , , ,101,2,2,1,14,101,6.875,20005,5,2,4,14,8,2012,3,6,61.8,1,1,2,18,3,2013,18,3,2013,3/18/2013,8/14/2012,3/18/2013,216,7,1,1,6.875,2,1,61.8,6,n,216,0,1,1,1,1,0,4,4,1,0,0,0,0,0,0,1,1,0,0,0,0,0,0,0,0,0
6,-1.89,-1.43,-2.15,-1.68,2,2,2,2,2,2,2,2,2,2,2,2,1,2,3,2,3,1,5,7,2010,2,32,1,2, , , , , , , , , , , , , , , , , , , , , , , , , , , , , , , , , , , , ,2, , , , , , , , , , , , , , , , , , ,101,3,2,1,14,101,6.875,30003,3,1,32,5,7,2010,1,10.65,87,2,1,2,18,3,2013,18,3,2013,3/18/2013,7/5/2010,3/18/2013,987,32,1,1,6.875,1,2,87,10.65,n,987, ,0,997, , , , , , , , , , , , , , , , , , , , , , , 
7,-2.47,-1.34,-2.47,-1.62,2,2,2,2,2,2,2,2,2,2,1,2,1,2,4,2,4,1,15,1,2011,2,26,1,2, , , , , , , , , , , , , , , , , , , , , , , , , , , , , , , , , , , , ,2, , , , , , , , , , , , , , , , , , ,101,4,2,1,14,101,6.875,40004,4,1,26,15,1,2011,3,9.45,81,2,1,2,18,3,2013,18,3,2013,3/18/2013,1/15/2011,3/18/2013,793,26,1,1,6.875,1,2,81,9.45,n,793, ,0,997, , , , , , , , , , , , , , , , , , , , , , , 
8,-1.39,-.87,-1.44,-1.07,2,2,2,2,2,2,2,2,2,2,2,2,2,2,4,5,6,2,18,2,2012,1,13,1,1,1,1, ,2,1,1,2, ,2, ,2,2,2, ,2,2,8,1,2,2,1,2,2,2,2,2,2,1,2,2,2,2,2,2,1,2,1,1,4,2,1,2, , , , , ,2,2,1,4, , , , ,101,4,2,1,14,101,6.875,40006,6,2,13,18,2,2012,3,7.7,71.5,1,1,2,18,3,2013,18,3,2013,3/18/2013,2/18/2012,3/18/2013,394,13,1,1,6.875,2,1,71.5,7.7,n,394,1,1,1,1,1,0,6,6,1,1,0,0,0,1,0,3,3,2,0,2,0,0,0,1,0,0
9,-2.94,.37,-1.72,-.05,2,2,2,2,2,2,2,2,2,2,1,2,2,2,5,2,7,1,15,4,2010,2,35,1,2, , , , , , , , , , , , , , , , , , , , , , , , , , , , , , , , , , , , ,2, , , , , , , , , , , , , , , , , , ,101,5,2,1,14,101,6.875,50007,7,1,35,15,4,2010,5,11.55,84.7,2,1,2,18,3,2013,18,3,2013,3/18/2013,4/15/2010,3/18/2013,1068,35,1,1,6.875,1,2,84.7,11.55,n,1068, ,0,997, , , , , , , , , , , , , , , , , , , , , , , 
10,-.13,-1.84,-1.43,-1.83,2,2,2,2,2,2,2,2,2,2,2,2,2,2,5,2,8,2,15,11,2012,0,4,1,1,1,1, ,2,2,2,2, ,2, ,2,2,2, ,2,2,2,2,2,2,2,2,2,2,2,2,2,2,2,2,2,2,2,2,2, ,2, , , , , , , , , , , , , , , , , , ,101,5,2,1,14,101,6.875,50008,8,2,4,15,11,2012,5,5.4,61.9,1,1,2,18,3,2013,18,3,2013,3/18/2013,11/15/2012,3/18/2013,123,4,1,1,6.875,2,1,61.9,5.4,n,123,0,0,997,0,1,1,2,3,0,0,0,0,0,0,0,0,0,0,0,0, ,0,0,0,0,0
11,-4.5,-.08,-3.25,-.75,2,2,2,2,2,2,2,2,2,2,1,1,1,1,6,2,8,2,15,8,2010,2,31,1,2, , , , , , , , , , , , , , , , , , , , , , , , , , , , , , , , , , , , ,2, , , , , , , , , , , , , , , , , , ,101,6,2,1,14,101,6.875,60008,8,2,31,15,8,2010,3,8.75,75.4,2,1,2,18,3,2013,18,3,2013,3/18/2013,8/15/2010,3/18/2013,946,31,1,1,6.875,2,2,75.4,8.75,n,946, ,0,997, , , , , , , , , , , , , , , , , , , , , , , 
12,-3.34,-3.46,-4.36,-3.61,2,2,2,1,1,1,1,2,2,2,1,1,1,1,6,2,9,2,24,3,2012,0,11,1,1,1,1, ,2,2,1,2, ,2, ,2,2,2, ,1,2,2,1,2,2,1,2,2,2,2,2,2,1,2,2,2,2,2,2,1,2,2, , , , , , , , , , , , , , , , , , ,101,6,2,1,14,101,6.875,60009,9,2,11,24,3,2012,3,5.2,65.2,1,1,2,18,3,2013,18,3,2013,3/18/2013,3/24/2012,3/18/2013,359,12,1,1,6.875,2,1,65.2,5.2,n,359,1,0,997,1,1,0,6,6,1,1,0,0,0,1,0,3,3,2,0,2,0,0,0,1,0,0
13,-3.42,.15,-2.17,-.4,2,2,2,2,2,2,2,2,2,2,1,1,1,2,7,2,7,1,15,10,2010,2,29,1,2, , , , , , , , , , , , , , , , , , , , , , , , , , , , , , , , , , , , ,2, , , , , , , , , , , , , , , , , , ,101,7,2,1,14,101,6.875,70007,7,1,29,15,10,2010,3,10.2,79.8,2,1,2,19,3,2013,19,3,2013,3/19/2013,10/15/2010,3/19/2013,886,29,1,1,6.875,1,2,79.8,10.2,n,886, ,0,997, , , , , , , , , , , , , , , , , , , , , , , 
14,-4.96,.81,-2.99,.37,2,2,2,2,2,2,2,2,2,2,1,1,1,2,8,2,3,2,2,4,2009,3,47,1,2, , , , , , , , , , , , , , , , , , , , , , , , , , , , , , , , , , , , ,1,1,4,4,2, , , , , , ,1,1,2, , , , , ,101,8,2,1,14,101,13.75,80003,3,2,47,2,4,2009,3,10.85,81.2,2,1,2,19,3,2013,19,3,2013,3/19/2013,4/2/2009,3/19/2013,1447,48,1,1,13.75,2,2,81.2,10.85,n,1447, ,1,1, , , , , , , , , , , , , , , , , , , , , , , 
15,-1.67,-3.34,-3.28,-3.44,2,2,2,1,1,1,1,2,2,2,2,2,1,1,9,2,3,1,5,4,2012,0,11,1,1,1,1, ,2,2,2,2, ,2, ,2,2,2, ,2,2,2,2,2,2,2,2,2,2,2,2,2,2,2,2,2,2,2,2,2, ,1,2,2,2,1,2, , , , , ,1,1,2, , , , , ,101,9,2,1,14,101,6.875,90003,3,1,11,5,4,2012,3,6.6,71.1,1,1,2,18,3,2013,18,3,2013,3/18/2013,4/5/2012,3/18/2013,347,11,1,1,6.875,1,1,71.1,6.6,n,347,0,1,1,0,1,1,2,5,0,0,0,0,0,0,0,0,0,0,0,0,0,0,0,0,0,0
16,-3.9,.31,-2.48,-.02,2,2,2,2,2,2,2,2,2,2,1,1,1,2,11,2,5,2,6,2,2009,4,49,1,2, , , , , , , , , , , , , , , , , , , , , , , , , , , , , , , , , , , , ,2, , , , , , , , , , , , , , , , , , ,101,11,2,1,14,101,6.875,110005,5,2,49,6,2,2009,3,11.75,86.5,2,1,2,18,3,2013,18,3,2013,3/18/2013,2/6/2009,3/18/2013,1501,49,1,1,6.875,2,2,86.5,11.75,n,1501, ,0,997, , , , , , , , , , , , , , , , , , , , , , , 
17,-3.12,-.78,-2.61,-1.31,2,2,2,2,2,2,2,2,2,2,1,1,1,2,11,6,6,2,13,5,2011,1,22,1,1,2, , ,2,2,2,2, ,2, ,2,1,2, ,1,2,2,1,2,2,1,2,2,2,2,2,2,2,2,2,2,1,2,2,1,4,2, , , , , , , , , , , , , , , , , , ,101,11,2,1,14,101,6.875,110006,6,2,22,13,5,2011,3,8.15,75,1,1,2,18,3,2013,18,3,2013,3/18/2013,5/13/2011,3/18/2013,675,22,1,1,6.875,2,1,75,8.15,n,675,1,0,997,1, ,0, ,7,1,0,0,0,0,1,0,2,2,4,0,4, ,0,0,1,1,0
18,-2.81,.07,-1.79,-.32,2,2,2,2,2,2,2,2,2,2,1,2,2,2,12,4,9,1,15,10,2010,2,29,1,2, , , , , , , , , , , , , , , , , , , , , , , , , , , , , , , , , , , , ,2, , , , , , , , , , , , , , , , , , ,101,12,2,1,14,101,9.16666666666667,120009,9,1,29,15,10,2010,5,10.65,81.8,2,1,2,18,3,2013,18,3,2013,3/18/2013,10/15/2010,3/18/2013,885,29,1,1,9.16666666666667,1,2,81.8,10.65,n,885, ,0,997, , , , , , , , , , , , , , , , , , , , , , , 
19,-2.86,-3,-3.76,-2.82,2,2,2,1,2,1,2,2,2,2,1,2,1,1,12,10,10,1,18,8,2012,1,7,1,1,1,1, ,1,1,2,2, ,2, ,2,1,2, ,1,2,1,1,2,2,2,2,2,2,2,2,2,2,2,2,2,2,2,2,1,2,1,2,4,2,1,2,3, , , ,2,1,1,2, , , , , ,101,12,2,1,14,101,9.16666666666667,120010,10,1,7,18,8,2012,3,5.4,62.9,1,1,2,18,3,2013,18,3,2013,3/18/2013,8/18/2012,3/18/2013,212,7,1,1,9.16666666666667,1,1,62.9,5.4,n,212,1,1,1,1,1,0,6,4,1,0,0,0,0,0,0,1,1,2,0,2,0,0,0,1,0,0
20, , , , , , , , , , , , , , , , , , ,12,4,11,1,18,8,2012,1,7,1,1,1,1, ,2,1,1,2, ,2, ,2,2,2, ,1,2,1,1,2,2,2,2,2,2,2,2,2,2,2,2,2,2,2,2,1,2,1,2,4,2,1,2,3, , , ,3,1,1,2, , , , , ,101,12,2,1,14,101,9.16666666666667,120011,11,1,7,18,8,2012,3,5.6,61.2,0,1,2,18,3,2013,18,3,2013,3/18/2013,8/18/2012,3/18/2013,212,7,1,1,9.16666666666667,1,0,61.2,5.6,n,212,1,1,1,1,1,0,6,4,1,0,0,0,0,0,0,1,1,2,0,2,0,0,0,1,0,0
21,-3.22,-.76,-2.74,-1.05,2,2,2,2,2,2,2,2,2,2,1,1,1,2,13,2,4,2,15,4,2010,2,35,1,2, , , , , , , , , , , , , , , , , , , , , , , , , , , , , , , , , , , , ,2, , , , , , , , , , , , , , , , , , ,101,13,2,1,14,101,10.3125,130004,4,2,35,15,4,2010,5,9.8,82.3,2,1,2,18,3,2013,18,3,2013,3/18/2013,4/15/2010,3/18/2013,1068,35,1,1,10.3125,2,2,82.3,9.8,n,1068, ,0,997, , , , , , , , , , , , , , , , , , , , , , , 
22,-1.09,-1.35,-1.61,-1.49,2,2,2,2,2,2,2,2,2,2,2,2,2,2,13,5,5,2,15,9,2011,1,18,1,1,2, , ,2,2,2,2, ,2, ,2,1,2, ,1,2,1,1,2,2,1,2,2,2,2,2,2,2,2,2,2,2,2,2,1,4,1,1,2,2,1,3, , , , ,3,1,2,2, , , , , ,101,13,2,1,14,101,10.3125,130005,5,2,18,15,9,2011,5,8.45,77.6,1,1,2,18,3,2013,18,3,2013,3/18/2013,9/15/2011,3/18/2013,550,18,1,1,10.3125,2,1,77.6,8.45,n,550,1,1,1,1, ,0, ,7,1,0,0,0,0,1,0,2,2,4,0,4, ,0,0,1,1,0
23,-3.69,1.46,-1.4,.67,2,2,2,2,2,2,2,1,2,2,1,1,2,2,14,6,6,1,3,3,2011,2,24,1,2, , , , , , , , , , , , , , , , , , , , , , , , , , , , , , , , , , , , ,2, , , , , , , , , , , , , , , , , , ,101,14,2,1,14,101,6.875,140006,6,1,24,3,3,2011,3,10.45,76.2,2,1,2,19,3,2013,19,3,2013,3/19/2013,3/3/2011,3/19/2013,747,25,1,1,6.875,1,2,76.2,10.45,n,747, ,0,997, , , , , , , , , , , , , , , , , , , , , , , 
24,-3.06,-1.44,-3.05,-1.92,2,2,2,2,2,2,2,2,2,2,1,1,1,1,15,4,4,2,5,5,2011,1,22,1,1,2, , ,2,2,2,2, ,2, ,2,1,2, ,1,2,2,1,2,2,2,2,2,2,2,2,2,2,2,2,1,2,2,2,1,4,2, , , , , , , , , , , , , , , , , , ,101,15,2,1,14,101,6.875,150004,4,2,22,5,5,2011,3,7.8,75.4,1,1,2,19,3,2013,19,3,2013,3/19/2013,5/5/2011,3/19/2013,684,22,1,1,6.875,2,1,75.4,7.8,n,684,1,0,997,1, ,0, ,7,1,0,0,0,0,0,0,1,1,4,0,4, ,0,0,1,1,0
25,-2.65,-.87,-2.26,-1.39,2,2,2,2,2,2,2,2,2,2,1,2,1,2,16,8,8,1,9,8,2011,1,19,1,1,2, , ,2,2,2,2, ,2, ,2,1,2, ,1,2,2,1,2,2,1,2,2,2,2,2,2,2,2,2,2,1,2,2,1,4,1,2,3,2,1,3, , , , ,3,2,2,1,1, , , , ,101,16,2,1,14,101,6.875,160008,8,1,19,9,8,2011,3,8.7,76.2,1,1,2,19,3,2013,19,3,2013,3/19/2013,8/9/2011,3/19/2013,588,19,1,1,6.875,1,1,76.2,8.7,n,588,1,1,0,1, ,0, ,7,1,0,0,0,0,1,0,2,2,4,0,4, ,0,0,1,1,0
26, , , , , , , , , , , , , , , , , , ,17,2,3,2,15,3,2010,3,36,1,2, , , , , , , , , , , , , , , , , , , , , , , , , , , , , , , , , , , , ,2, , , , , , , , , , , , , , , , , , ,101,17,2,1,14,101,13.75,170003,3,2,36,15,3,2010,5,7,68.2,2,1,2,18,3,2013,18,3,2013,3/18/2013,3/15/2010,3/18/2013,1099,36,1,1,13.75,2,2,68.2,7,n,1099, ,0,997, , , , , , , , , , , , , , , , , , , , , , , 
27,-3.33,-.78,-2.8,-1.21,2,2,2,2,2,2,2,2,2,2,1,1,1,2,18,2,4,1,15,5,2008,4,58,1,2, , , , , , , , , , , , , , , , , , , , , , , , , , , , , , , , , , , , ,2, , , , , , , , , , , , , , , , , , ,101,18,2,1,14,101,6.875,180004,4,1,58,15,5,2008,3,12.5,93.7,2,1,2,18,3,2013,18,3,2013,3/18/2013,5/15/2008,3/18/2013,1768,58,1,1,6.875,1,2,93.7,12.5,n,1768, ,0,997, , , , , , , , , , , , , , , , , , , , , , , 
28,-4.12,-.04,-2.95,-.52,2,2,2,2,2,2,2,2,2,2,1,1,1,2,18,2,5,2,2,5,2010,2,34,1,2, , , , , , , , , , , , , , , , , , , , , , , , , , , , , , , , , , , , ,2, , , , , , , , , , , , , , , , , , ,101,18,2,1,14,101,6.875,180005,5,2,34,2,5,2010,3,9.5,78.6,2,1,2,18,3,2013,18,3,2013,3/18/2013,5/2/2010,3/18/2013,1051,35,1,1,6.875,2,2,78.6,9.5,n,1051, ,0,997, , , , , , , , , , , , , , , , , , , , , , , 
29,-1.24,-.31,-.83,-.09,2,2,2,2,2,2,2,2,2,2,2,2,2,2,19,2,3,2,11,3,2013,0, ,1,1,1,1, ,2,2,2,2, ,2, ,2,2,2, ,2,2,2,2,2,2,2,2,2,2,2,2,2,2,2,2,2,2,2,2,2, ,2, , , , , , , , , , , , , , , , , , ,101,19,2,1,14,101,6.875,190003,3,2,99,11,3,2013,3,2.95,48,1,1,2,18,3,2013,18,3,2013,3/18/2013,3/11/2013,3/18/2013,7,0,1,1,6.875,2,1,48,2.95,n,7,0,0,997,0,1,1,2,1,0,0,0,0,0,0,0,0,0,0,0,0, ,0,0,0,0,0
30, , , , , , , , , , , , , , , , , , ,19,2,5,2,5,1,2010,3,38,1,2, , , , , , , , , , , , , , , , , , , , , , , , , , , , , , , , , , , , ,2, , , , , , , , , , , , , , , , , , ,101,19,2,1,14,101,6.875,190005,5,2,38,5,1,2010,3,13.45,98.2,2,1,1,18,3,2013,18,3,2013,3/18/2013,1/5/2010,3/18/2013,1168,38,1,1,6.875,2,2,98.2,13.45,y,1168, ,0,997, , , , , , , , , , , , , , , , , , , , , , , 
31,-2.41,-1.24,-2.45,-1.46,2,2,2,2,2,2,2,2,2,2,1,2,1,2,21,3,6,2,2,1,2010,3,38,1,2, , , , , , , , , , , , , , , , , , , , , , , , , , , , , , , , , , , , ,2, , , , , , , , , , , , , , , , , , ,101,21,2,1,14,101,6.875,210006,6,2,38,2,1,2010,3,10.55,87.3,2,1,2,18,3,2013,18,3,2013,3/18/2013,1/2/2010,3/18/2013,1171,38,1,1,6.875,2,2,87.3,10.55,n,1171, ,0,997, , , , , , , , , , , , , , , , , , , , , , , 
32,.19,-1.57,-1.06,-1.5,2,2,2,2,2,2,2,2,2,2,2,2,2,2,21,7,7,1,13,9,2012,1,6,1,1,1,1, ,2,2,1,2, ,2, ,2,2,2, ,2,2,2,2,2,2,2,2,2,2,2,2,2,2,2,2,2,2,2,2,2, ,2, , , , , , , , , , , , , , , , , , ,101,21,2,1,14,101,6.875,210007,7,1,6,13,9,2012,3,7.1,68.2,1,1,2,18,3,2013,18,3,2013,3/18/2013,9/13/2012,3/18/2013,186,6,1,1,6.875,1,1,68.2,7.1,n,186,0,0,997,1,1,0,3,4,0,0,0,0,0,0,0,0,0,0,0,0,0,0,0,0,0,0
33,-3.74,1.95,-1.15,1.55,1,2,2,2,2,2,2,1,2,2,1,1,2,2,22,2,10,2,1,2,2010,3,37,1,2, , , , , , , , , , , , , , , , , , , , , , , , , , , , , , , , , , , , ,2, , , , , , , , , , , , , , , , , , ,101,22,2,1,14,101,6.875,220010,10,2,37,1,2,2010,3,12.2,81.6,2,1,2,18,3,2013,18,3,2013,3/18/2013,2/1/2010,3/18/2013,1141,38,1,1,6.875,2,2,81.6,12.2,n,1141, ,0,997, , , , , , , , , , , , , , , , , , , , , , , 
34,1.81,-1.31,.08,-.88,2,2,2,2,2,2,2,2,2,2,2,2,2,2,23,2,3,1,31,12,2011,1,15,1,1,1,2,2,2,2,1,2, ,2, ,2,2,2, ,2,2,2,1,2,2,2,2,2,2,1,2,1,2,2,1,2,2,2,2,2,2,1,2,4,4,2, , , , , , ,2,2,2, , , , , ,353,23,1,3,1,353,15.625,230003,3,1,15,31,12,2011,1,10.2,82.6,1,1,2,3,3,2013,18,3,2013,3/18/2013,12/31/2011,3/3/2013,428,14,3,1,15.625,1,1,82.6,10.2,n,428,1,1,1,1,0,0,1,6,1,0,0,1,0,0,0,2,2,2,0,2,0,0,0,1,0,0
35,-1.12,-.23,-.85,-.26,2,2,2,2,2,2,2,2,2,2,2,2,2,2,23,2,4,2,5,4,2009,3,47,1,2, , , , , , , , , , , , , , , , , , , , , , , , , , , , , , , , , , , , ,2, , , , , , , , , , , , , , , , , , ,353,23,1,3,1,353,15.625,230004,4,2,47,5,4,2009,1,14.15,97.3,2,1,2,3,3,2013,18,3,2013,3/18/2013,4/5/2009,3/3/2013,1428,47,3,1,15.625,2,2,97.3,14.15,n,1428, ,0,997, , , , , , , , , , , , , , , , , , , , , , , 
36,-1.73,-1.28,-1.93,-1.41,2,2,2,2,2,2,2,2,2,2,2,2,2,2,24,2,7,1,15,3,2008,5,60,2, , , , , , , , , , , , , , , , , , , , , , , , , , , , , , , , , , , , , , , , , , , , , , , , , , , , , , , , ,101,24,2,1,14,101,6.875,240007,7,1,60,15,3,2008,3,14.2,102,2,1,2,18,3,2013,18,3,2013,3/18/2013,3/15/2008,3/18/2013,1829,60,1,1,6.875,1,2,102,14.2,n,1829, , , , , , , , , , , , , , , , , , , , , , , , , , 
37,-.33,-.76,-.73,-.75,2,2,2,2,2,2,2,2,2,2,2,2,2,2,24,8,8,2,19,5,2012,1,10,1,1,1,2,2,1,2,1,2, ,1,2,2,1,2, ,1,2,1,1,2,2,1,2,2,2,2,2,2,2,2,2,2,2,2,2,1,1,2, , , , , , , , , , , , , , , , , , ,101,24,2,1,14,101,6.875,240008,8,2,10,19,5,2012,3,7.75,70.6,1,1,2,18,3,2013,18,3,2013,3/18/2013,5/19/2012,3/18/2013,303,10,1,1,6.875,2,1,70.6,7.75,n,303,1,0,997,1,0,0,1,5,1,0,1,0,0,1,0,3,2,1,2,3,0,0,0,0,0,0
38,-1.68,-1.54,-2.11,-1.52,2,2,2,2,2,2,2,2,2,2,2,2,1,2,25,2,3,1,15,7,2012,1,8,1,1,1,1, ,2,2,2,2, ,2, ,2,2,2, ,1,2,1,1,2,2,1,2,2,2,2,2,1,2,2,2,2,2,2,2,1,4,1,2,2,2,1,2, , , , ,2,1,2,1,1,9, , , ,101,25,2,1,14,101,6.875,250003,3,1,8,15,7,2012,3,6.85,67,1,1,2,18,3,2013,18,3,2013,3/18/2013,7/15/2012,3/18/2013,246,8,1,1,6.875,1,1,67,6.85,n,246,1,1,1,1,1,0,6,4,1,0,0,1,0,1,0,3,3,4,0,4,0,0,0,1,1,0
39,-4.15,-.09,-3.01,-.57,2,2,2,2,2,2,2,2,2,2,1,1,1,1,25,2,4,2,15,4,2010,2,35,1,2, , , , , , , , , , , , , , , , , , , , , , , , , , , , , , , , , , , , ,1,2,1,1,1,3, , , , ,3,1,2,1,1, , , , ,101,25,2,1,14,101,6.875,250004,4,2,35,15,4,2010,5,9.5,78.8,2,1,2,18,3,2013,18,3,2013,3/18/2013,4/15/2010,3/18/2013,1068,35,1,1,6.875,2,2,78.8,9.5,n,1068, ,1,1, , , , , , , , , , , , , , , , , , , , , , , 
40, , , , , , , , , , , , , , , , , , ,25,8,9,1,24,8,2011,1,18,1,1,1,1, ,2,2,2,2, ,2, ,2,2,2, ,1,2,1,1,2,2,1,2,2,2,2,2,1,2,2,2,2,2,2,2,1,5,2, , , , , , , , , , , , , , , , , , ,101,25,2,1,14,101,6.875,250009,9,1,18,24,8,2011,3,9.15,75,0,1,1,18,3,2013,18,3,2013,3/18/2013,8/24/2011,3/18/2013,572,19,1,1,6.875,1,0,75,9.15,y,572,1,0,997,1,1,0,6,7,1,0,0,1,0,1,0,3,3,5,0,5,0,0,0,1,1,0
41,-1.47,.87,-.38,.82,2,2,2,2,2,2,2,2,2,2,2,2,2,2,25,8,10,1,15,10,2008,4,53,1,2, , , , , , , , , , , , , , , , , , , , , , , , , , , , , , , , , , , , ,2, , , , , , , , , , , , , , , , , , ,101,25,2,1,14,101,6.875,250010,10,1,53,15,10,2008,5,16.35,99.7,2,1,2,18,3,2013,18,3,2013,3/18/2013,10/15/2008,3/18/2013,1615,53,1,1,6.875,1,2,99.7,16.35,n,1615, ,0,997, , , , , , , , , , , , , , , , , , , , , , , 
42,-2.77,.38,-1.45,-.2,2,2,2,2,2,2,2,2,2,2,1,2,2,2,26,2,3,1,28,9,2011,1,17,1,1,1,1, ,2,2,2,2, ,2, ,2,2,2, ,1,2,2,2,2,2,2,2,2,2,2,2,2,2,2,2,2,2,2,2,1,5,1,2,2,2,1,3, , , , , ,1,2,1,1, , , , ,101,26,2,1,14,101,6.875,260003,3,1,17,28,9,2011,3,9.25,74.5,1,1,2,18,3,2013,18,3,2013,3/18/2013,9/28/2011,3/18/2013,537,18,1,1,6.875,1,1,74.5,9.25,n,537,0,1,1,1,1,0,4,7,1,0,0,0,0,0,0,1,1,5,0,5,0,0,0,1,1,0
43,-3.77,-.95,-3.28,-1.31,2,2,2,2,2,2,2,2,2,2,1,1,1,1,26,2,4,2,15,7,2009,3,44,1,2, , , , , , , , , , , , , , , , , , , , , , , , , , , , , , , , , , , , ,1,1,1,1,1,3, , , , , ,1,2,1,1, , , , ,101,26,2,1,14,101,6.875,260004,4,2,44,15,7,2009,3,10.1,84.7,2,1,2,18,3,2013,18,3,2013,3/18/2013,7/15/2009,3/18/2013,1342,44,1,1,6.875,2,2,84.7,10.1,n,1342, ,1,1, , , , , , , , , , , , , , , , , , , , , , , 
44, , , , , , , , , , , , , , , , , , ,26,9,10,2,15,9,2011,1,18,1,1,1,1, ,2,2,2,2, ,2, ,2,2,2, ,1,2,2,1,2,2,1,2,2,2,2,2,2,1,2,2,2,2,2,2,1,4,2, , , , , , , , , , , , , , , , , , ,101,26,2,1,14,101,6.875,260010,10,2,18,15,9,2011,5,6.25,72.2,0,1,2,18,3,2013,18,3,2013,3/18/2013,9/15/2011,3/18/2013,550,18,1,1,6.875,2,0,72.2,6.25,n,550,1,0,997,1,1,0,6,7,1,1,0,0,0,1,0,3,3,4,0,4,0,0,0,1,1,0
45,-3.99,-.84,-3.34,-1.47,2,2,2,2,2,2,2,2,2,2,1,1,1,1,26,9,11,1,15,4,2009,3,47,1,2, , , , , , , , , , , , , , , , , , , , , , , , , , , , , , , , , , , , ,2, , , , , , , , , , , , , , , , , , ,101,26,2,1,14,101,6.875,260011,11,1,47,15,4,2009,5,10.65,86.2,2,1,2,18,3,2013,18,3,2013,3/18/2013,4/15/2009,3/18/2013,1433,47,1,1,6.875,1,2,86.2,10.65,n,1433, ,0,997, , , , , , , , , , , , , , , , , , , , , , , 
46,-.86,2.21,1.17,2.22,1,1,2,2,2,2,2,1,1,2,2,2,2,2,28,8,9,2,15,8,2012,1,7,1,1,1,1, ,2,2,2,2, ,2, ,2,2,2, ,1,2,2,1,2,2,2,2,2,2,2,2,2,2,2,2,2,2,2,2,2, ,2, , , , , , , , , , , , , , , , , , ,101,28,2,1,14,101,6.875,280009,9,2,7,15,8,2012,5,8.85,65.4,1,1,2,18,3,2013,18,3,2013,3/18/2013,8/15/2012,3/18/2013,215,7,1,1,6.875,2,1,65.4,8.85,n,215,1,0,997,1,1,0,6,4,1,0,0,0,0,0,0,1,1, ,0, ,0,0,0, , ,0
47,-2.79,-.53,-2.24,-.79,2,2,2,2,2,2,2,2,2,2,1,2,1,2,28,8,10,2,15,8,2010,2,31,1,2, , , , , , , , , , , , , , , , , , , , , , , , , , , , , , , , , , , , ,2, , , , , , , , , , , , , , , , , , ,101,28,2,1,14,101,6.875,280010,10,2,31,15,8,2010,5,9.85,81.5,2,1,2,18,3,2013,18,3,2013,3/18/2013,8/15/2010,3/18/2013,946,31,1,1,6.875,2,2,81.5,9.85,n,946, ,0,997, , , , , , , , , , , , , , , , , , , , , , , 
48,-2.03,-1.44,-2.27,-1.78,2,2,2,2,2,2,2,2,2,2,1,2,1,2,29,3,3,2,15,11,2011,1,16,1,1,1,1, ,2,2,2,2, ,2, ,2,2,2, ,2,2,2,1,2,2,1,2,2,2,2,2,2,2,2,2,2,2,2,2,2, ,2, , , , , , , , , , , , , , , , , , ,101,29,2,1,14,101,6.875,290003,3,2,16,15,11,2011,5,7.5,73,1,1,2,18,3,2013,18,3,2013,3/18/2013,11/15/2011,3/18/2013,489,16,1,1,6.875,2,1,73,7.5,n,489,1,0,997,0,1,0,6,6,1,0,0,0,0,1,0,2,2, ,0, ,0,0,0, , ,0
49,-1.01,-1.91,-1.86,-2.03,2,2,2,1,2,2,2,2,2,2,2,2,2,2,29,2,4,1,11,3,2010,3,36,1,2, , , , , , , , , , , , , , , , , , , , , , , , , , , , , , , , , , , , ,2, , , , , , , , , , , , , , , , , , ,101,29,2,1,14,101,6.875,290004,4,1,36,11,3,2010,3,11.5,92.5,2,1,2,18,3,2013,18,3,2013,3/18/2013,3/11/2010,3/18/2013,1103,36,1,1,6.875,1,2,92.5,11.5,n,1103, ,0,997, , , , , , , , , , , , , , , , , , , , , , , 
50, , , , , , , , , , , , , , , , , , ,30,2,3,2,15,10,2010, ,5,1,1,1,1, ,2,2,2,2, ,2, ,2,2,2, ,2,1,1,2,2,2,2,2,2,2,2,2,2,2,2,2,2,2,2,2,2, ,2, , , , , , , , , , , , , , , , , , ,101,30,2,1,14,101,6.875,300003,3,2,5,15,10,2010,3,5.7,60.5,1,1,2,19,3,2013,19,3,2013,3/19/2013,10/15/2010,3/19/2013,886,29,1,1,6.875,2,1,60.5,5.7,n,886,0,0,997,1,1,0,4, ,0,0,0,0,0,0,0,0,0,0,0,0, ,0,0,0,0,0
51, , , , , , , , , , , , , , , , , , ,30,2,4,1,15,4,2008,4,59,1,2, , , , , , , , , , , , , , , , , , , , , , , , , , , , , , , , , , , , ,2, , , , , , , , , , , , , , , , , , ,101,30,2,1,14,101,6.875,300004,4,1,59,15,4,2008,3,5.7,60.5,1,1,2,19,3,2013,19,3,2013,3/19/2013,4/15/2008,3/19/2013,1799,59,1,1,6.875,1,1,60.5,5.7,n,1799, ,0,997, , , , , , , , , , , , , , , , , , , , , , , 
52,-2.42,-.76,-2.03,-1.16,2,2,2,2,2,2,2,2,2,2,1,2,1,2,31,2,3,2,15,12,2011,1,15,1,1,1,1, ,2,2,2,2, ,2, ,2,2,2, ,1,2,2,1,2,2,1,2,2,2,2,2,2,2,2,2,2,2,2,2,2,4,2, , , , , , , , , , , , , , , , , , ,101,31,2,1,14,101,10.3125,310003,3,2,15,15,12,2011,5,7.55,71,1,1,2,19,3,2013,19,3,2013,3/19/2013,12/15/2011,3/19/2013,460,15,1,1,10.3125,2,1,71,7.55,n,460,1,0,997,1,1,0,6,6,1,0,0,0,0,1,0,2,2,4,0,4,0,0,0,1,1,0
53,.24,.29,.38,.26,2,2,2,2,2,2,2,2,2,2,2,2,2,2,31,2,4,2,15,9,2010,2,30,1,2, , , , , , , , , , , , , , , , , , , , , , , , , , , , , , , , , , , , ,2, , , , , , , , , , , , , , , , , , ,101,31,2,1,14,101,10.3125,310004,4,2,30,15,9,2010,5,13.35,91.6,2,1,2,19,3,2013,19,3,2013,3/19/2013,9/15/2010,3/19/2013,916,30,1,1,10.3125,2,2,91.6,13.35,n,916, ,0,997, , , , , , , , , , , , , , , , , , , , , , , 
54,-3.97,-1.58,-3.82,-1.94,2,2,2,2,2,2,2,2,2,2,1,1,1,1,32,2,3,2,15,3,2010,2,26,1,2, , , , , , , , , , , , , , , , , , , , , , , , , , , , , , , , , , , , ,2, , , , , , , , , , , , , , , , , , ,101,32,2,1,14,101,6.875,320003,3,2,26,15,3,2010,5,8.65,80,2,1,2,19,3,2013,19,3,2013,3/19/2013,3/15/2010,3/19/2013,1100,36,1,1,6.875,2,2,80,8.65,n,1100, ,0,997, , , , , , , , , , , , , , , , , , , , , , , 
55,-1.65,.4,-.76,.33,2,2,2,2,2,2,2,2,2,2,2,2,2,2,32,2,4,2,15,3,2009,4,48,1,8, , , , , , , , , , , , , , , , , , , , , , , , , , , , , , , , , , , , ,2, , , , , , , , , , , , , , , , , , ,101,32,2,1,14,101,6.875,320004,4,2,48,15,3,2009,5,14.5,95.7,2,1,2,19,3,2013,19,3,2013,3/19/2013,3/15/2009,3/19/2013,1465,48,1,1,6.875,2,2,95.7,14.5,n,1465, ,0,997, , , , , , , , , , , , , , , , , , , , , , , 
56, , , , , , , , , , , , , , , , , , ,32,8,9,1,15,3,2011,2,24,1,2, , , , , , , , , , , , , , , , , , , , , , , , , , , , , , , , , , , , ,2, , , , , , , , , , , , , , , , , , ,101,32,2,1,14,101,6.875,320009,9,1,24,15,3,2011,5,10,80.7,0,1,2,19,3,2013,19,3,2013,3/19/2013,3/15/2011,3/19/2013,735,24,1,1,6.875,1,0,80.7,10,n,735, ,0,997, , , , , , , , , , , , , , , , , , , , , , , 
57,-1.21,-.16,-.85,-.18,2,2,2,2,2,2,2,2,2,2,2,2,2,2,33,2,8,2,15, ,2008,4,48,1,2, , , , , , , , , , , , , , , , , , , , , , , , , , , , , , , , , , , , ,2, , , , , , , , , , , , , , , , , , ,101,33,2,1,14,101,6.875,330008,8,2,48,15, ,2008,5,14.3,97.5,2,1,2,19,3,2013,19,3,2013,3/19/2013, ,3/19/2013,1460.016,48,1,1,6.875,2,2,97.5,14.3,n,1460.016, ,0,997, , , , , , , , , , , , , , , , , , , , , , , 
58,-4.8,-1.59,-4.37,-2.22,2,2,2,1,2,2,2,2,2,2,1,1,1,1,33,2,9,2,15, ,2010,2,33,1,2, , , , , , , , , , , , , , , , , , , , , , , , , , , , , , , , , , , , ,1,1,4,2,1,3, , , , ,3,2,2,2, , , , , ,101,33,2,1,14,101,6.875,330009,9,2,33,15, ,2010,5,7.7,75.3,2,1,2,19,3,2013,19,3,2013,3/19/2013, ,3/19/2013,1003.761,33,1,1,6.875,2,2,75.3,7.7,n,1003.761, ,1,1, , , , , , , , , , , , , , , , , , , , , , , 